t02005

6bae8a4

1 @ SunOS 5.11 i86pc 1.04 32_gcc4.7 uplex

*    top   0.0 TEST ../../../bin/varnishtest/tests/t02005.vtc starting
[...]
*    top   0.0 TEST H2 POST
[...]
**** v1    0.2 CLI RX|
**** v1    0.2 CLI RX|Type 'help' for command list.
**** v1    0.2 CLI RX|Type 'quit' to close CLI session.
**** v1    0.2 CLI RX|Type 'start' to launch worker process.
**** v1    0.2 CLI TX|vcl.inline vcl1 << %XJEIFLH|)Xspa8P
**** v1    0.2 CLI TX|vcl 4.0;
**** v1    0.2 CLI TX|backend s1 { .host = "127.0.0.1"; .port = "34477"; }
**** v1    0.2 CLI TX|
**** v1    0.2 CLI TX|
**** v1    0.2 CLI TX|%XJEIFLH|)Xspa8P
***  v1    0.2 vsl|No VSL chunk found (child not started ?)
***  v1    0.2 CLI RX  106
**** v1    0.2 CLI RX|Message from VCC-compiler:
**** v1    0.2 CLI RX|Security: Privilege proc_setid missing, will not change uid/gid
**** v1    0.2 CLI RX|Message from C-compiler:
**** v1    0.2 CLI RX|Security: Privilege proc_setid missing, will not change uid/gid
**** v1    0.2 CLI RX|vgc.c:540:27: error: expected '=', ',', ';', 'asm' or '__attribute__' before 'is'
**** v1    0.2 CLI RX|vgc.c:540:27: error: unknown type name 'is'
**** v1    0.2 CLI RX|vgc.c:677:22: error: expected '=', ',', ';', 'asm' or '__attribute__' before 'VRT_r_beresp_backend'
**** v1    0.2 CLI RX|vgc.c: In function 'VGC_function_vcl_backend_error':
**** v1    0.2 CLI RX|vgc.c:1158:7: error: implicit declaration of function 'VRT_SetHdr' [-Werror=implicit-function-declaration]
**** v1    0.2 CLI RX|vgc.c:1158:7: error: nested extern declaration of 'VRT_SetHdr' [-Werror=nested-externs]
**** v1    0.2 CLI RX|vgc.c:1173:11: error: implicit declaration of function 'VRT_INT_string' [-Werror=implicit-function-declaration]
**** v1    0.2 CLI RX|vgc.c:1173:11: error: nested extern declaration of 'VRT_INT_string' [-Werror=nested-externs]
**** v1    0.2 CLI RX|vgc.c:1199:7: error: implicit declaration of function 'VRT_handling' [-Werror=implicit-function-declaration]
**** v1    0.2 CLI RX|[21 lines truncated]
**** v1    0.2 CLI RX|Running C-compiler failed, exited with 1
**** v1    0.2 CLI RX|VCL compilation failed
---- v1    0.2 FAIL VCL does not compile
*    top   0.2 RESETTING after ../../../bin/varnishtest/tests/t02005.vtc
**   s1    0.2 Waiting for server (3/-1)
**** s1    0.2 macro undef s1_addr
**** s1    0.2 macro undef s1_port
**** s1    0.2 macro undef s1_sock
**   v1    0.2 Wait
**** v1    0.2 STDOUT poll 0x10
**   v1    0.2 R 87367 Status: 0000 (u 0.039000 s 0.055000)
***  v1    0.3 vsl|No VSL chunk found (child not started ?)
*    top   0.3 TEST ../../../bin/varnishtest/tests/t02005.vtc FAILED
#    top  TEST ../../../bin/varnishtest/tests/t02005.vtc FAILED (0.323) exit=2