t02003

8572a43

could not get frame header

1 @ SunOS 5.11 i86pc 1.04 32_sun12.4 uplex

*    top   0.0 TEST ../../../bin/varnishtest/tests/t02003.vtc starting
[...]
*    top   0.0 TEST H2 Frame coverage/error conditions
[...]
**** v1    3.2 vsl|          0 CLI             - Wr 200 19 PONG 1493447188 1.0
**** v1    6.2 vsl|          0 CLI             - Rd ping
**** v1    6.2 vsl|          0 CLI             - Wr 200 19 PONG 1493447191 1.0
**** v1    9.2 vsl|          0 CLI             - Rd ping
**** v1    9.2 vsl|          0 CLI             - Wr 200 19 PONG 1493447194 1.0
**** v1   12.2 vsl|          0 CLI             - Rd ping
**** v1   12.2 vsl|          0 CLI             - Wr 200 19 PONG 1493447197 1.0
**** v1   15.2 vsl|          0 CLI             - Rd ping
**** v1   15.2 vsl|          0 CLI             - Wr 200 19 PONG 1493447200 1.0
**** v1   18.2 vsl|          0 CLI             - Rd ping
**** v1   18.2 vsl|          0 CLI             - Wr 200 19 PONG 1493447203 1.0
**** v1   21.2 vsl|          0 CLI             - Rd ping
**** v1   21.2 vsl|          0 CLI             - Wr 200 19 PONG 1493447206 1.0
**** v1   24.2 vsl|          0 CLI             - Rd ping
**** v1   24.2 vsl|          0 CLI             - Wr 200 19 PONG 1493447209 1.0
**** v1   27.2 vsl|          0 CLI             - Rd ping
**** v1   27.2 vsl|          0 CLI             - Wr 200 19 PONG 1493447212 1.0
**** v1   30.2 vsl|          0 CLI             - Rd ping
**** v1   30.2 vsl|          0 CLI             - Wr 200 19 PONG 1493447215 1.0
***  c1   32.2 HTTP2 rx timeout (fd:4 30000 ms)
---- c1   32.2 could not get frame header
**   c1   32.2 Ending stream 3
***  c1   32.2 closing fd 4
**   c1   32.2 Ending
*    top  32.2 RESETTING after ../../../bin/varnishtest/tests/t02003.vtc
**   s1   32.2 Waiting for server (3/-1)
**** s1   32.2 macro undef s1_addr
**** s1   32.2 macro undef s1_port
**** s1   32.2 macro undef s1_sock
**   v1   32.2 Wait
***  v1   32.2 debug|Debug: Stopping Child
**** v1   32.2 vsl|          0 CLI             - EOF on CLI connection, worker stops
***  v1   33.2 debug|Info: Child (72703) ended
***  v1   33.2 debug|Info: Child (72703) said Child dies
***  v1   33.2 debug|Debug: Child cleanup complete
***  v1   33.2 debug|
**** v1   33.2 STDOUT poll 0x10
**   v1   33.2 R 72592 Status: 0000 (u 0.069000 s 0.105000)
*    top  33.2 TEST ../../../bin/varnishtest/tests/t02003.vtc FAILED
#    top  TEST ../../../bin/varnishtest/tests/t02003.vtc FAILED (33.233) exit=2

95a34ee

1 @ SunOS 5.11 i86pc 1.04 32_sun12.4 uplex

*    top   0.0 TEST ../../../bin/varnishtest/tests/t02003.vtc starting
[...]
*    top   0.0 TEST H2 Frame coverage/error conditions
[...]
**** v1    3.2 vsl|          0 CLI             - Rd ping
**** v1    3.2 vsl|          0 CLI             - Wr 200 19 PONG 1493434177 1.0
**** v1    6.2 vsl|          0 CLI             - Rd ping
**** v1    6.2 vsl|          0 CLI             - Wr 200 19 PONG 1493434180 1.0
**** v1    9.2 vsl|          0 CLI             - Rd ping
**** v1    9.2 vsl|          0 CLI             - Wr 200 19 PONG 1493434183 1.0
**** v1   12.2 vsl|          0 CLI             - Rd ping
**** v1   12.2 vsl|          0 CLI             - Wr 200 19 PONG 1493434186 1.0
**** v1   15.2 vsl|          0 CLI             - Rd ping
**** v1   15.2 vsl|          0 CLI             - Wr 200 19 PONG 1493434189 1.0
**** v1   18.2 vsl|          0 CLI             - Rd ping
**** v1   18.2 vsl|          0 CLI             - Wr 200 19 PONG 1493434192 1.0
**** v1   21.2 vsl|          0 CLI             - Rd ping
**** v1   21.2 vsl|          0 CLI             - Wr 200 19 PONG 1493434195 1.0
**** v1   24.2 vsl|          0 CLI             - Rd ping
**** v1   24.2 vsl|          0 CLI             - Wr 200 19 PONG 1493434198 1.0
**** v1   27.2 vsl|          0 CLI             - Rd ping
**** v1   27.2 vsl|          0 CLI             - Wr 200 19 PONG 1493434201 1.0
**** v1   30.2 vsl|          0 CLI             - Rd ping
**** v1   30.2 vsl|          0 CLI             - Wr 200 19 PONG 1493434204 1.0
***  c1   32.2 HTTP2 rx timeout (fd:4 30000 ms)
---- c1   32.2 could not get frame header
**   c1   32.2 Ending stream 3
***  c1   32.2 closing fd 4
**   c1   32.2 Ending
*    top  32.2 RESETTING after ../../../bin/varnishtest/tests/t02003.vtc
**   s1   32.2 Waiting for server (3/-1)
**** s1   32.2 macro undef s1_addr
**** s1   32.2 macro undef s1_port
**** s1   32.2 macro undef s1_sock
**   v1   32.2 Wait
***  v1   32.2 debug|Debug: Stopping Child
**** v1   32.2 vsl|          0 CLI             - EOF on CLI connection, worker stops
***  v1   33.2 debug|Info: Child (60553) ended
***  v1   33.2 debug|Info: Child (60553) said Child dies
***  v1   33.2 debug|Debug: Child cleanup complete
**** v1   33.2 STDOUT poll 0x10
**   v1   33.2 R 60442 Status: 0000 (u 0.066000 s 0.098000)
*    top  33.2 TEST ../../../bin/varnishtest/tests/t02003.vtc FAILED
#    top  TEST ../../../bin/varnishtest/tests/t02003.vtc FAILED (33.229) exit=2

3d60db6

Failed to open 127.0.0.1 42364: (null)

1 @ SunOS 5.11 i86pc 1.04 64_gcc4.7 uplex

*    top   0.0 TEST ../../../bin/varnishtest/tests/t02003.vtc starting
[...]
*    top   0.0 TEST H2 Frame coverage/error conditions
[...]
**   c1    1.6 Ending stream 0
**   c1    1.6 Starting stream 63ab90
**   c1    1.6 Waiting for stream 0
**   c1    1.6 === txsettings -winsize 0x80000000
***  c1    1.6 tx: stream: 0, type: SETTINGS (4), flags: 0x00, size: 6
**   c1    1.6 === rxgoaway
***  c1    1.6 rx: stream: 0, type: GOAWAY (7), flags: 0x00, size: 8
***  c1    1.6 goaway->laststream: 0
***  c1    1.6 goaway->err: FLOW_CONTROL_ERROR (3)
**   c1    1.6 === expect goaway.err == FLOW_CONTROL_ERROR
**** c1    1.6 EXPECT goaway.err (3) == "3" match
**   c1    1.6 === expect goaway.laststream == 0
**** c1    1.6 EXPECT goaway.laststream (0) == "0" match
**   c1    1.6 Ending stream 0
***  c1    1.6 closing fd 4
**   c1    1.6 Ending
**   top   1.6 === client c1 {
**   c1    1.6 Starting client
**   c1    1.6 Waiting for client
***  c1    1.6 Connect to 127.0.0.1 42364
---- c1    1.6 Failed to open 127.0.0.1 42364: (null)
*    top   1.6 RESETTING after ../../../bin/varnishtest/tests/t02003.vtc
**   s1    1.6 Waiting for server (3/-1)
**** s1    1.6 macro undef s1_addr
**** s1    1.6 macro undef s1_port
**** s1    1.6 macro undef s1_sock
**   v1    1.6 Wait
***  v1    1.6 debug|Debug: Stopping Child
**** v1    1.6 vsl|       1019 Begin           c sess 0 HTTP/1
**** v1    1.6 vsl|       1019 SessOpen        c 127.0.0.1 39629 127.0.0.1:42364 127.0.0.1 42364 1493316509.191662 18
**** v1    1.6 vsl|          0 Debug           - H2 Prior Knowledge Upgrade
**** v1    1.6 vsl|       1019 Debug           c H2: Got pu PRISM
**** v1    1.6 vsl|       1019 H2TxHdr         c 00000c040000000000
**** v1    1.6 vsl|       1019 H2TxBody        c 00030000006400040000ffff
**** v1    1.6 vsl|       1019 H2RxHdr         c 000000040000000000
**** v1    1.6 vsl|       1019 Debug           c H2RXF SETTINGS[0] 0x00 0x00000000
**** v1    1.6 vsl|       1019 H2TxHdr         c 000000040100000000
**** v1    1.6 vsl|       1019 H2RxHdr         c 000000040100000000
**** v1    1.6 vsl|       1019 Debug           c H2RXF SETTINGS[0] 0x01 0x00000000
**** v1    1.6 vsl|       1019 H2RxHdr         c 000001040100000000

could not get frame header

2 @ SunOS 5.11 i86pc 1.04 32_gcc4.7 uplex

*    top   0.0 TEST ../../../bin/varnishtest/tests/t02003.vtc starting
[...]
*    top   0.0 TEST H2 Frame coverage/error conditions
[...]
**** v1    3.3 vsl|          0 CLI             - Wr 200 19 PONG 1493309321 1.0
**** v1    6.3 vsl|          0 CLI             - Rd ping
**** v1    6.3 vsl|          0 CLI             - Wr 200 19 PONG 1493309324 1.0
**** v1    9.3 vsl|          0 CLI             - Rd ping
**** v1    9.3 vsl|          0 CLI             - Wr 200 19 PONG 1493309327 1.0
**** v1   12.3 vsl|          0 CLI             - Rd ping
**** v1   12.3 vsl|          0 CLI             - Wr 200 19 PONG 1493309330 1.0
**** v1   15.3 vsl|          0 CLI             - Rd ping
**** v1   15.3 vsl|          0 CLI             - Wr 200 19 PONG 1493309333 1.0
**** v1   18.3 vsl|          0 CLI             - Rd ping
**** v1   18.3 vsl|          0 CLI             - Wr 200 19 PONG 1493309336 1.0
**** v1   21.3 vsl|          0 CLI             - Rd ping
**** v1   21.3 vsl|          0 CLI             - Wr 200 19 PONG 1493309339 1.0
**** v1   24.3 vsl|          0 CLI             - Rd ping
**** v1   24.3 vsl|          0 CLI             - Wr 200 19 PONG 1493309342 1.0
**** v1   27.3 vsl|          0 CLI             - Rd ping
**** v1   27.3 vsl|          0 CLI             - Wr 200 19 PONG 1493309345 1.0
**** v1   30.3 vsl|          0 CLI             - Rd ping
**** v1   30.3 vsl|          0 CLI             - Wr 200 19 PONG 1493309348 1.0
***  c1   32.2 HTTP2 rx timeout (fd:4 30000 ms)
---- c1   32.2 could not get frame header
**   c1   32.2 Ending stream 3
***  c1   32.2 closing fd 4
**   c1   32.2 Ending
*    top  32.2 RESETTING after ../../../bin/varnishtest/tests/t02003.vtc
**   s1   32.2 Waiting for server (3/-1)
**** s1   32.2 macro undef s1_addr
**** s1   32.2 macro undef s1_port
**** s1   32.2 macro undef s1_sock
**   v1   32.2 Wait
***  v1   32.2 debug|Debug: Stopping Child
**** v1   32.2 vsl|          0 CLI             - EOF on CLI connection, worker stops
***  v1   33.2 debug|Info: Child (56145) ended
***  v1   33.2 debug|Info: Child (56145) said Child dies
***  v1   33.2 debug|Debug: Child cleanup complete
***  v1   33.2 debug|
**** v1   33.2 STDOUT poll 0x10
**   v1   33.2 R 56086 Status: 0000 (u 0.074000 s 0.084000)
*    top  33.2 TEST ../../../bin/varnishtest/tests/t02003.vtc FAILED
#    top  TEST ../../../bin/varnishtest/tests/t02003.vtc FAILED (33.227) exit=2